CA/NAV/AERO
type: Concept
in scheme: providers
definition: Execute the government's policy at all the fields related to civil Aviation & Met. Affairs, construct, operate, run, organize and maintain the airports and grand services. Run, Support, develop and invest all civil Aviation & Met. Utilities. Run, organize & develop all air transport affairs in Yemen. Run and organize air traffic according to the dominant rights for the Republic of Yemen on the international Agreements and treaties. Summary Provided By: http://www.yemencivilaviation.com/Home/tabid/36/Default.aspx

CANADA
type: Concept