TRANSPARENCY METER
type: Concept
in scheme: instruments
definition: Transparency meters (SS meters) provide an important management parameter for the water quality standards of discharged water. The CST-200 transparency meter (SS meter) performs continuous measurement of the transparency (suspended solid concentration) of discharged water. This meter can be effectively used for notification of water quality abnormalities and for management of the operating conditions of wastewater treatment facilities. Additional information available at "http://www.cos-co.com/agriculture_e/cst-200/" [Summary provided by COS]

Photon/Optical Detectors
type: Concept