MSU-E
type: Concept
in scheme: instruments
definition: The Multichannel High Resolution Electronic Scanner (MSU-E) is a multi-spectral optical-electronic radiometer containing three CCD line arrays - one for each spectral band. [Summary provided by ScanEx]

Imaging Spectrometers/Radiometers
type: Concept