SOIL COMPACTION
type: Concept
in scheme: sciencekeywords
definition: The reduction in bulk volume or thickness of a soil owing to increasing weight of overlying material that is continually being deposited, or to pressures from earth movements, resulting in a decrease of porosity.

SOILS
type: Concept