TANSO-CAI
type: Concept
change note: 2012-09-05 16:23:13.0 [mpmorahan] Insert Concept add broader relation (TANSO-CAI [e0f71e02-6540-4207-ba18-aacf55057144,40551] - Spectrometers [055a79c7-61db-4250-abad-f1e09909f14c,32653]);
change note: 2018-06-08 17:11:59.0 [sritz] Move Concepts delete narrower relation (null);
change note: 2021-08-05 17:40:34.0 [sritz] insert AltLabel (id: null category: primary text: TANSO-CAI language code: en);
change note: 2018-06-08 17:11:40.0 [sritz] Move Concepts add narrower relation (TANSO-CAI [e0f71e02-6540-4207-ba18-aacf55057144,348939] - PCASP [0ea6e92c-3970-4662-a960-b928fc46ec8b,346311]);
definition: CAI( visualizes the state of the atmosphere and the ground surface during the daytime. The image data from CAI are used to determine the cloud existence over an extended area that includes the FTS's field of view (FOV). When clouds and aerosols are detected in FOV, cloud characteristics and aerosol amounts are calculated. The information is used to correct the effects of the clouds and the aerosols on the spectra obtained with FTS. Group: Instrument_Details Entry_ID: TANSO-CAI Group: Instrument_Identification Instrument_Category: Earth Remote Sensing Instruments Instrument_Class: Passive Remote Sensing Instrument_Type: Spectrometers/Radiometers Instrument_Subtype: Spectrometers Short_Name: TANSO-CAI Long_Name: Thermal And Near-infrared Sensor for carbon Observation - Cloud and Aerosol Imager End_Group Creation_Date: 2012-08-30 End_Group
in scheme: instruments

Spectrometers
type: Concept