BCLME
type: Concept
in scheme: projects
definition: The Benguela Current Large Marine Ecosystem (BCLME)draft proposal was submitted to the GEF for funding through the United National Development Programme (UNDP) in 1997. The BCLME Programme aims to enhance national and regional efforts towards sustainable and integrated management of the Benguela Current Large Marine Ecosystem. This has been carried out by establishing a regional co-operative mechanism, undertaking a review of existing knowledge of the status and threats to the BCLME and developing a Strategic Action Programme (SAP) to address both these threats and gaps in knowledge essential to the sustainable management of the ecosystem. Dr Michael O^?Toole Regional Co-ordinator Ministry of Fisheries and Marine Resources Private Bag x 13355 Windhoek NAMIBIA Tel: 264-61-2053084 Fax: 264-61-220558 Email: bclme@mweb.com.na Webpage: "http://www.bclme.org"

A - C
type: Concept