FLUVIAL LANDFORMS
type: Concept

CONFLUENCE
type: Concept
change note: 2013-08-15 12:37:08.0 [tbs1979] insert Definition (id: null text: The meeting of two or more bodies of water. language code: en);
change note: 2013-08-05 12:29:27.0 [tbs1979] Insert Concept add broader relation (CONFLUENCE [e18c970a-d0c6-4430-b419-64cf718bc456,105301] - FLUVIAL LANDFORMS [bdc0bd86-a3a3-48fa-b1fb-4ca5d13d4dde,105281]);
in scheme: sciencekeywords
definition: The meeting of two or more bodies of water.