UMD/ASTRO/BIMA
type: Concept
in scheme: providers
definition: The Combined Array for Research in Millimeter-wave Astronomy (CARMA) is a university-based millimeter array consisting of six 10.4-meter and nine 6.1-meter antennas that are used in combination to image astronomical Universe at millimeter wavelengths. Located on a new high-altitude site in eastern California, CARMA provides unparalleled sensitivity, broad frequency coverage, sub-arcsecond resolution and wide-field heterogeneous imaging capabilities, along with innovative technologies and educational opportunities. Summary Provided By: http://www.mmarray.org/

ACADEMIC
type: Concept