CALIFORNIA
type: Concept

CA/DOC/DLRP
type: Concept
in scheme: providers
definition: The California Division of Land Resource Protection provides information to guide land use planning decisions and programs in California that allow agricultural and open space landowners to voluntarily protect their land. Website: "http://www.consrv.ca.gov/dlrp/"