SOIL CHEMISTRY
type: Concept
in scheme: sciencekeywords
definition: The branch of soil science that deals with the chemical constitution, chemical properties, and chemical reactions of soils.

SOILS
type: Concept