MARINE GEOPHYSICS
type: Concept

MAGNETIC ANOMALIES
type: Concept
in scheme: sciencekeywords
definition: Pertaining to the areas of the oceanic crust where the remnant magnetic signature is different than that of the Earth's magnetic field.