Advanced Land Observing Satellite (ALOS)
type: Concept

ALOS-2
type: Concept
change note: 2021-02-26 13:17:17.0 [mmorahan] insert WeightedRelation (id: null related concept uuid: 3ebe0137-dcd0-41d1-96f5-3966884431c6 relationship type: null relationship value: null generated by: null);
change note: 2020-10-05 13:39:57.0 [sritz] update Definition (The Advanced Land Observing Satellite-2 (ALOS-2) is follow-on mission from the "DAICHI", which contributed to cartography, regional observation, disaster monitoring, and resource surveys. ALOS-2 will succeed this mission with enhanced capabilities. Specifically, JAXA is conducting research and development activities to improve wide and high-resolution observation technologies developed for DAICHI in order to further fulfill social needs. These social needs include: 1) Disaster monitoring of damage areas, both in cosiderable detail, and when these areas may be large 2) Continuous updating of data archives related to national land and infrastructure information 3) Effective monitoring of cultivated areas 4) Global monitoring of tropical rain forests to identify carbon sinks. The state-of-the-art L-band Synthetic Aperture Radar (SAR) aboard ALOS-2, which is an active microwave radar using the 1.2GHz frequency range, will, in responding to society's needs, have enhanced performance compared to DAICHI/PALSAR. The SAR is capable of observing day and night, and in all weather conditions. The Advanced Land Observing Satellite-2 (ALOS-2) is follow-on mission from the "DAICHI", which contributed to cartography, regional observation, disaster monitoring, and resource surveys. ALOS-2 will succeed this mission with enhanced capabilities. Specifically, JAXA is conducting research and development activities to improve wide and high-resolution observation technologies developed for DAICHI in order to further fulfill social needs. These social needs include: 1) Disaster monitoring of damage areas, both in cosiderable detail, and when these areas may be large 2) Continuous updating of data archives related to national land and infrastructure information 3) Effective monitoring of cultivated areas 4) Global monitoring of tropical rain forests to identify carbon sinks. The state-of-the-art L-band Synthetic Aperture Radar (SAR) aboard ALO…
change note: 2021-12-02 08:44:04.0 [tstevens] Move Concepts delete broader relation (null); add broader relation (ALOS-2 [e4009ba2-7e5d-41ea-b4f9-c45788ad8589,826842] - Advanced Land Observing Satellite (ALOS) [6cca285c-edc4-4147-ba57-9cbbffbc0ae6,835935]);
definition: The Advanced Land Observing Satellite-2 (ALOS-2) is follow-on mission from the "DAICHI", which contributed to cartography, regional observation, disaster monitoring, and resource surveys. ALOS-2 will succeed this mission with enhanced capabilities. Specifically, JAXA is conducting research and development activities to improve wide and high-resolution observation technologies developed for DAICHI in order to further fulfill social needs. These social needs include: 1) Disaster monitoring of damage areas, both in cosiderable detail, and when these areas may be large 2) Continuous updating of data archives related to national land and infrastructure information 3) Effective monitoring of cultivated areas 4) Global monitoring of tropical rain forests to identify carbon sinks. The state-of-the-art L-band Synthetic Aperture Radar (SAR) aboard ALOS-2, which is an active microwave radar using the 1.2GHz frequency range, will, in responding to society's needs, have enhanced performance compared to DAICHI/PALSAR. The SAR is capable of observing day and night, and in all weather conditions. The Advanced Land Observing Satellite-2 (ALOS-2) is follow-on mission from the "DAICHI", which contributed to cartography, regional observation, disaster monitoring, and resource surveys. ALOS-2 will succeed this mission with enhanced capabilities. Specifically, JAXA is conducting research and development activities to improve wide and high-resolution observation technologies developed for DAICHI in order to further fulfill social needs. These social needs include: 1) Disaster monitoring of damage areas, both in cosiderable detail, and when these areas may be large 2) Continuous updating of data archives related to national land and infrastructure information 3) Effective monitoring of cultivated areas 4) Global monitoring of tropical rain forests to identify carbon sinks. The state-of-the-art L-band Synthetic Aperture Radar (SAR) aboard ALOS-2, which is an active microwave radar using the…
in scheme: platforms