Himawari-9
type: Concept
in scheme: platforms
change note: 2018-07-27 16:27:30.0 [sritz] insert AltLabel (id: null category: null text: 41836 language code: en);
change note: 2018-07-27 16:20:38.0 [sritz] Move Concepts delete broader relation (null); add broader relation (Himawari-9 [e43cfa6a-fb75-4eeb-8674-25917275ea7e,368003] - Himawari [d8b7fc7d-9cf3-4020-947d-f33d712b64ab,345895]);
change note: 2018-07-27 16:26:46.0 [sritz] insert Definition (id: null text: Himawari 9 is the second of two third-generation satellites in Japan’s Himawari weather-monitoring series. Alongside Himawari 8, which was launched in October 2014, it is expected to provide the Japan Meteorological Agency (JMA) and the Ministry of Transport with observational data into the late 2020s language code: en);
change note: 2018-07-27 16:28:14.0 [sritz] update Definition (Himawari 9 is the second of two third-generation satellites in Japan’s Himawari weather-monitoring series. Alongside Himawari 8, which was launched in October 2014, it is expected to provide the Japan Meteorological Agency (JMA) and the Ministry of Transport with observational data into the late 2020s Facts in Brief Launch Date: 2016-11-02 Launch Vehicle: H-2A Launch Site: Tanegashima, Japan Mass: 1300.0 kg);
change note: 2018-07-27 16:20:17.0 [sritz] Insert Concept add broader relation (Himawari-9 [e43cfa6a-fb75-4eeb-8674-25917275ea7e,368003] - Himawari-8 [dd2591d9-35a1-4037-9664-bbfcf4c80b71,345927]);
alternative label: 41836
definition: Himawari 9 is the second of two third-generation satellites in Japan’s Himawari weather-monitoring series. Alongside Himawari 8, which was launched in October 2014, it is expected to provide the Japan Meteorological Agency (JMA) and the Ministry of Transport with observational data into the late 2020s Facts in Brief Launch Date: 2016-11-02 Launch Vehicle: H-2A Launch Site: Tanegashima, Japan Mass: 1300.0 kg

Himawari
type: Concept