G - I
type: Concept

GHRSST
type: Concept
in scheme: projects
definition: The Long Term Stewardship and Reanalysis Facility (LTSRF) for the GODAE High Resolution SST (GHRSST) Project seeks to rapidly and routinely deliver individual as well as multi-sensor blended SST products with high accuracy and fine spatial resolution. Please see the GHRSST web site for detailed information on this international effort http://ghrsst.nodc.noaa.gov/