SOIL FERTILITY
type: Concept
in scheme: sciencekeywords
definition: The quality of a soil that enables it to provide essential chemical elements in quantities and proportions for the growth of specified plants.

SOILS
type: Concept