EROSION/SEDIMENTATION
type: Concept

SEDIMENT TRANSPORT
type: Concept
change note: 2017-03-10 08:51:14.0 [tstevens] update Definition (The movement of sediment by natural agents (such as flowing water, ice, wind, or gravity) either as solid particles or in solution, from one place to another on the earth's surface.); update Definition (Dictionary of Geological Terms, American Geological Institute, 1984. );
in scheme: sciencekeywords
definition: The movement of sediment by natural agents (such as flowing water, ice, wind, or gravity) either as solid particles or in solution, from one place to another on the earth's surface.