SBAS
type: Concept

SBAS P
type: Concept
definition: SBAS is a satellite-based augmentation system that supports wide-area or regional augmentation through the use of additional satellite broadcast messages. There are several SBAS systems around the world, such as WAAS in the U.S. and EGNOS in Europe.
in scheme: instruments
change note: 2017-08-14 15:51:24.0 [tstevens] Insert Concept add broader relation (SBAS P [e5099d68-1165-4af4-bc2b-24e94c744ce3,310047] - SBAS [50731a19-972c-4337-b964-378d623f3c03,310035]);
change note: 2017-08-14 15:51:42.0 [tstevens] insert AltLabel (id: null category: primary text: Satellite-Based Augmentation System Payload language code: en);
change note: 2017-08-15 10:59:05.0 [tstevens] insert Definition (id: null text: SBAS is a satellite-based augmentation system that supports wide-area or regional augmentation through the use of additional satellite broadcast messages. There are several SBAS systems around the world, such as WAAS in the U.S. and EGNOS in Europe. language code: en);