Probes
type: Concept

NEVZOROV PROBE
type: Concept
in scheme: instruments
definition: The Nevzorov probe is a constant temperature hot wire probe and consists of two separate sensors for measuring the total water content (liquid water [which includes frozen species] content, LWC, and total water content, TWC) of clouds and fog in the range between 0.003 gm-3 and 3 gm-3. [Summary provided by Global Hydrology Resource Center, Marshall Space Flight Center, NASA] Group: Instrument_Details Entry_ID: NEVZOROV PROBE Group: Instrument_Identification Instrument_Category: In Situ/Laboratory Instruments Instrument_Class: Probes Instrument_Type: NEVZOROV PROBE Short_Name: NEVZOROV PROBE Long_Name: Nevzorov Water Vapor Probe End_Group Group: Associated_Platforms Short_Name: UND CITATION II End_Group Online_Resource: http://ghrc.nsstc.nasa.gov/ End_Group