KMSS
type: Concept
change note: 2015-08-03 13:00:28.0 [mpmorahan] insert AltLabel (id: null text: Multispectral Imager (VIS) system language code: en);
change note: 2015-08-03 12:53:00.0 [mpmorahan] Insert Concept add broader relation (KMSS [e549f821-0712-41c2-a558-0f55f6c8ba80,158171] - Imaging Spectrometers/Radiometers [944b7691-af37-4fb4-9393-c114e7997829,144651]);
in scheme: instruments
definition: Multispectral Imager (VIS) system (KMSS) Group: Instrument_Details Entry_ID: KMSS Group: Instrument_Identification Instrument_Category: Earth Remote Sensing Instruments Instrument_Class: Passive Remote Sensing Instrument_Type: Spectrometers/Radiometers Instrument_Subtype: Imaging Spectrometers/Radiometers Short_Name: KMSS Long_Name: Multispectral Imager (VIS) system End_Group Group: Associated_Platforms Short_Name: Meteor-3M Short_Name: Meteor-M N1 Short_Name: Meteor-M N2 End_Group Group: Spectral_Frequency_Information Wavelength_Keyword: Visible Spectral_Frequency_Coverage_Range: 0.4 µm - 0.9 µm End_Group Group: Spectral_Frequency_Information Wavelength_Keyword: Near Infrared Spectral_Frequency_Coverage_Range: 0.4 µm - 0.9 µm End_Group Online_Resource: http://www.wmo-sat.info/oscar/instruments/view/242 Online_Resource: http://ofo.ikiweb.ru/en/msu.php Sample_Image: http://s017.radikal.ru/i435/1506/bc/24ef74242990.jpg Creation_Date: 2015-01-26 Group: Instrument_Logistics Instrument_Owner: Russia/ROSCOSMOS End_Group End_Group

Imaging Spectrometers/Radiometers
type: Concept