MAXIMUM/MINIMUM TEMPERATURE
type: Concept

6 HOUR MAXIMUM TEMPERATURE
type: Concept
change note: 2013-10-16 18:34:57.0 [saritz] added new definition insert Definition (id: null text: The highest temperature reported for a given location during a (6 hour) period. language code: en);
change note: 2013-09-04 14:08:51.0 [epneff] Insert Concept add broader relation (6 HOUR MAXIMUM TEMPERATURE [e56bcf72-f331-4545-948f-73fe0193b1bd,105787] - MAXIMUM/MINIMUM TEMPERATURE [5164162a-60eb-4c94-a0f0-2caaa3bb1754,86703]);
in scheme: sciencekeywords
definition: The highest temperature reported for a given location during a (6 hour) period.