TRANSMISSOMETERS
type: Concept
in scheme: instruments
definition: TRANSMISSOMETERS are meters that measure the intensity of a distant light; also measures the extinction coefficient of the atmosphere and for the determination of the visual range.

Photometers
type: Concept