FOREST FIRE SCIENCE
type: Concept
in scheme: sciencekeywords
definition: The branch of Forestry that studies the effects, benefits, prevention, movement, and ecology of Fire in forests. May include any Forest Fire related items.

FOREST SCIENCE
type: Concept