NC/NCSU/CLIM
type: Concept
definition: The State Climate Office of North Carolina is the primary source for NC weather and climate information. Located in the Research III Building on the Centennial Campus of North Carolina State University, the State Climate Office (SCO) is actively involved in all aspects of climate research, education, and extension services. The SCO is an extension of the University of North Carolina system and housed at NC State University. The SCO is supported by the College of Physical and Mathematical Sciences (PAMS), the NC Agricultural Research Service, and the Department of Marine, Earth, and Atmospheric Sciences (MEAS) in an effort to further understand the details and impacts of climate on industries and citizens in North Carolina. Website: https://climate.ncsu.edu/ [Summary provided by the State Climate Office of North Carolina]
change note: 2020-02-06 16:36:13.0 [sritz] update Definition (The State Climate Office of North Carolina is the primary source for NC weather and climate information. Located in the Research III Building on the Centennial Campus of North Carolina State University, the State Climate Office (SCO) is actively involved in all aspects of climate research, education, and extension services. The SCO is an extension of the University of North Carolina system and housed at NC State University. The SCO is supported by the College of Physical and Mathematical Sciences (PAMS), the NC Agricultural Research Service, and the Department of Marine, Earth, and Atmospheric Sciences (MEAS) in an effort to further understand the details and impacts of climate on industries and citizens in North Carolina. Website: https://climate.ncsu.edu/ [Summary provided by the State Climate Office of North Carolina]); update Resource (provider); update Resource (https://climate.ncsu.edu/);
change note: 2020-02-06 16:37:06.0 [sritz] update Definition (https://climate.ncsu.edu/);
in scheme: providers

NORTH CAROLINA
type: Concept