LAND/OCEAN/ICE FRACTION
type: Concept
change note: 2022-08-12 12:39:20.0 [sritz] insert Definition (id: null text: These keywords are used to identify the type of grid location. language code: en);
change note: 2022-08-12 12:30:00.0 [sritz] Insert Concept add broader relation (LAND/OCEAN/ICE FRACTION [e63e32cc-896c-47dd-9652-a01ba2ee3334,1011387] - GEOLOGICAL FEATURES [035d870c-9792-4a74-8e02-e03c9a671c8e,1011385]);
in scheme: sciencekeywords
definition: These keywords are used to identify the type of grid location.

GEOLOGICAL FEATURES
type: Concept