KARST HYDROLOGY
type: Concept
change note: 2013-08-20 10:49:14.0 [tbs1979] insert Definition (id: null text: Karst Hydrology refers to the extensive dissolution of rock has led to the development of subterranean channels through which groundwater flows in conduits (enclosed or semi-enclosed channels). These conduits can vary in size from slightly enlarged cracks to tunnels many meters in diameter and many kilometers in length. language code: en);
change note: 2013-08-05 14:19:57.0 [tbs1979] Insert Concept add broader relation (KARST HYDROLOGY [e657b41f-4aa0-4816-b3c8-5b477812a0bc,105473] - KARST PROCESSES [9cd875b0-210b-458f-b208-1690f50820d0,86105]);
in scheme: sciencekeywords
definition: Karst Hydrology refers to the extensive dissolution of rock has led to the development of subterranean channels through which groundwater flows in conduits (enclosed or semi-enclosed channels). These conduits can vary in size from slightly enlarged cracks to tunnels many meters in diameter and many kilometers in length.

KARST PROCESSES
type: Concept