SURFACE MASS
type: Concept

MASS TRANSPORT
type: Concept
change note: 2021-05-21 08:41:14.0 [tstevens] update Definition (https://podaac.jpl.nasa.gov/dataset/TELLUS_GRAC_L3_JPL_RL06_LND_v03);
change note: 2021-05-14 09:32:27.0 [tstevens] insert Definition (id: null text: The change in mass from one specified period of time to another specified period of time. language code: en);
change note: 2021-05-14 09:31:27.0 [tstevens] Insert Concept add broader relation (MASS TRANSPORT [e660d917-0c77-463c-a15b-e8061ed296f8,606945] - SURFACE MASS [295c1f0b-bb76-4cbc-88cf-a42e6fb83bfb,606943]);
in scheme: sciencekeywords
definition: The change in mass from one specified period of time to another specified period of time.