UAZ/CS
type: Concept
in scheme: providers
definition: The Department of Computer Science emphasizes high quality research and instruction in an atmosphere where undergraduate as well as graduate students benefit from the Department's research programs. Summary Provided By: http://www.cs.arizona.edu/personnel/

ACADEMIC
type: Concept