U.S. SATELLITE LABORATORY
type: Concept
in scheme: providers
definition: U.S. Satellite Laboratory, Inc. began in 1991. U.S. Satellite programs utilize animal tracking, 3D, and weather data to excite students, promote inquiry, and increase student achievement. Research-based, proven, teacher training, and classroom-based curriculum spark the interests of educators and students. Teachers can enhance learning in science and mathematics using technology as a research and analysis tool. Summary Provided By: http://www.us-satellite.net/

CONSORTIA/INSTITUTIONS
type: Concept