CA/RA/CLP
type: Concept
in scheme: providers
definition: The California Legacy Project was an exciting initiative that involved a broad range of government agencies and citizen organizations. Working collaboratively, it developed a suite of tools and maps to help Californians make the important decisions about conserving and protecting the state's bountiful working lands and magnificent natural resources. Summary provided by http://legacy.ca.gov/

CALIFORNIA
type: Concept