ORBIT TYPE
type: Concept
change note: 2013-04-02 10:10:21.0 [tbs1979] insert Definition (id: null text: The orbit of a satellite, which may include Low Earth Orbit (LEO), Medium Earth Orbit (MEO), Geosynchronous Orbit (GEO), Highly Elliptical Orbit (HEO), or Lagrangian Point Orbit (LPO). language code: en);
change note: 2013-02-18 09:42:19.0 [tbs1979] Insert Concept add broader relation (ORBIT TYPE [e709d2f9-c110-4e71-b4da-ff1a7c382d99,82389] - SATELLITE ORBITS/REVOLUTION [71278ba7-9a13-43ba-9ec3-62ae2b39de88,62977]);
in scheme: sciencekeywords
definition: The orbit of a satellite, which may include Low Earth Orbit (LEO), Medium Earth Orbit (MEO), Geosynchronous Orbit (GEO), Highly Elliptical Orbit (HEO), or Lagrangian Point Orbit (LPO).

SATELLITE ORBITS/REVOLUTION
type: Concept