CA/NS/MRB
type: Concept
in scheme: providers
definition: The Nova Scotia Department of Natural Resources Library is part of the Information Management Section of the Planning Secretariat. The Library serves Department of Natural Resources staff, provincial and federal government personnel, mining and forestry industries, prospectors, scientists, consultants, educators, students and the general public.

CANADA
type: Concept