SEA SURFACE TEMPERATURE RECONSTRUCTION
type: Concept
in scheme: sciencekeywords
definition: Reconstruction of past sea surface temperatures (SST) based on paleoclimate proxy records.

PALEOCLIMATE RECONSTRUCTIONS
type: Concept