Positioning/Navigation
type: Concept

RF ANTENNA
type: Concept
in scheme: instruments
definition: A RF ANTENNA is an antenna or an electrical device that sends or receives radio or television signals that is used to help further study lightning and its detection.