Photon/Optical Detectors
type: Concept

CORONAGRAPHS
type: Concept
in scheme: instruments
definition: CORONAGRAPHS are instruments used for photographing the corona and prominences of the sun at times other than at solar eclipse.