STD
type: Concept
in scheme: providers
definition: Science once held that the universe outside our world was a perfect one, with all objects out there being a glorious testament to the divine creator. That idea came crashing to earth in 1609, when Galileo Galilei pointed his home-made telescope at the moon and found it was a rugged, mountainous and cratered world. The illusion of perfection was shattered. Summary Provided by: http://www.spacew.com/

COMMERCIAL
type: Concept