SOURCEFORGE
type: Concept
change note: 2018-01-24 09:18:26.0 [tstevens] update Definition (SourceForge.net is the world's largest Open Source software development web site. SourceForge.net provides free hosting to Open Source software development projects with a centralized resource for managing projects, issues, communications, and code.); update Resource (provider); update Resource (https://sourceforge.net/);
in scheme: providers
definition: SourceForge.net is the world's largest Open Source software development web site. SourceForge.net provides free hosting to Open Source software development projects with a centralized resource for managing projects, issues, communications, and code.

CONSORTIA/INSTITUTIONS
type: Concept