EPA
type: Concept

EPA/TTN/CATC
type: Concept
change note: 2012-11-27 08:42:12.0 [tbs1979] Insert Concept add broader relation (EPA/TTN/CATC [e90633d3-4dde-41d5-a440-9147ad07e3c7,82007] - EPA [782baf09-4a51-4245-b913-40008bde17dd,66459]);
in scheme: providers
definition: The EPA Clean Air Technology Center (CATC) serves as a resource on all areas of emerging and existing air pollution prevention and control technologies, and provides public access to data and information on their use, effectiveness and cost. In addition, the CATC will provide technical support, including access to EPA’s knowledge base, to government agencies and others, as resources allow, related to the technical and economic feasibility, operation and maintenance of these technologies. [Summary provided by the EPA.]