KWARE - GS
type: Concept
in scheme: providers
definition: ERUPT is a graphical program that simulates various volcanic eruption types, including Strombolian, Plinian, Vulcanian pyroclastic flows and surges, Hawaiian fluid lava flows, fumarolic activity, and Peléean viscous lava dome emplacement. Tectonic (faulting), caldera and sector collapse, and erosional events are also simulated. While version 2.4 of Erupt is still available for free downloads, Erupt3 is now freely available from RockWare. In addition to a greater variety of eruption types, virtual 3-D with topographic and geological maps, and a greatly enhanced user interface, Erupt3 offers the user a built-in updater with web-access and features that make it a much more robust teaching and research tool. Please see the Erupt3 New Features page for more information. Summary Provided By: http://www.ees1.lanl.gov/Wohletz/Erupt.htm

COMMERCIAL
type: Concept