M - O
type: Concept

OCO-3
type: Concept
in scheme: projects
change note: 2020-05-22 11:51:17.0 [sritz] Insert Concept add broader relation (OCO-3 [e96c71fe-f051-4506-ba2d-ceea070b2cda,560239] - M - O [a31c2828-9b6d-44e9-b6ad-7ae81030f322,548709]);
change note: 2021-10-26 14:09:23.0 [sritz] update Definition (Source: https://ocov3.jpl.nasa.gov/);
change note: 2020-05-22 11:58:55.0 [sritz] insert AltLabel (id: null category: primary text: Orbiting Carbon Observatory - 3 language code: en);
change note: 2020-05-22 12:00:34.0 [sritz] update AltLabel (Orbiting Carbon Observatory-3); insert Definition (id: null text: [Source: https://ocov3.jpl.nasa.gov/quick-facts/ ] Orbiting Carbon Observatory-3 (OCO-3) will be flying on the International Space Station (ISS) and will continue the important measurement begun by OCO-2 in 2014. Some quick facts about OCO-3 are: OCO-3 is a critical element in the continuation of global carbon dioxide (CO2) measurements focused on understanding the regional sources and sinks of CO2 from the unique vantage point of the International Space Station (ISS). OCO-3 can also contribute to focused studies of how space based measurements can constrain rapidly changing anthropogenic (man-made) emissions. Anthropogenic emissions could be the largest source of uncertainty in the global carbon budget as OCO-3 measurements reduce uncertainty of natural fluxes. OCO-3 has the ability to makes measurements at different times of the day. OCO-3 measurements can be combined with evapotranspiration and biomass measurements, such as those from other ISS instruments ECOSTRESS and GEDI, to study process details of the terrestrial ecosystem. OCO-2 has demonstrated that atmospheric XCO2 can be measured from space with precision of better than 1 ppm. OCO-3 is expected to have similar performance. More Information: https://ocov3.jpl.nasa.gov/ language code: en);
definition: [Source: https://ocov3.jpl.nasa.gov/quick-facts/ ] Orbiting Carbon Observatory-3 (OCO-3) will be flying on the International Space Station (ISS) and will continue the important measurement begun by OCO-2 in 2014. Some quick facts about OCO-3 are: OCO-3 is a critical element in the continuation of global carbon dioxide (CO2) measurements focused on understanding the regional sources and sinks of CO2 from the unique vantage point of the International Space Station (ISS). OCO-3 can also contribute to focused studies of how space based measurements can constrain rapidly changing anthropogenic (man-made) emissions. Anthropogenic emissions could be the largest source of uncertainty in the global carbon budget as OCO-3 measurements reduce uncertainty of natural fluxes. OCO-3 has the ability to makes measurements at different times of the day. OCO-3 measurements can be combined with evapotranspiration and biomass measurements, such as those from other ISS instruments ECOSTRESS and GEDI, to study process details of the terrestrial ecosystem. OCO-2 has demonstrated that atmospheric XCO2 can be measured from space with precision of better than 1 ppm. OCO-3 is expected to have similar performance. More Information: https://ocov3.jpl.nasa.gov/