DOI
type: Concept

DOI/BLM/OFA/NIFC
type: Concept
in scheme: providers
definition: The National Interagency Fire Center provides information on where recent fires have taken place. Updated reports are updated Monday ? Friday. The NIFC provides safety tips, fire prevention, training, and outreach programs for children who are unaware of the dangers of fires. Website: http://www.nifc.gov/ [Summary provided by the U.S. Department of the Interior.]