RADIONUCLIDES
type: Concept
in scheme: sciencekeywords
definition: Nuclides which are unstable and that decay or disintegrate spontaneously, emitting radiation. A synonym for radioactive nuclide.

OCEAN CHEMISTRY
type: Concept