ACADEMIC
type: Concept

USASK/GIS
type: Concept
in scheme: providers
definition: The University of Saskatchewan belongs to the people of Saskatchewan. As an academic community, our mission is to achieve excellence in the scholarly activities of teaching, discovering, preserving, and applying knowledge. Summary provided by: http://www.usask.ca/uofs/fact_sheet.php#mission