RU/RAS/CEPL
type: Concept
in scheme: providers
definition: The Centre for Problems of Ecology and Productivity of Forests (CEPF) has the wide international communications, and it executes the important co-ordinating role on realisation of the international projects with the key aerospace world agencies, including NASA and the European Space Agency. The Centre has the close communication with the leading universities and forest institutes of higher education of Russia, it renders an assistance in conducting and perfection of educational process. The Centre on the problems of ecology and productivity of forests substantially influences on the forming of state policy in area of forestry and the rational forest management. By the certificate of claim of the results of it’s fundamental researches, there is implementation of the special purpose planned tasks within the framework of Programs of the Presidium of RAS, the MNR programs, numerous grants of the RFFY, FTSP «Integration», and the international projects.

RUSSIA
type: Concept