AIMMS-30
type: Concept
change note: 2017-03-08 16:31:59.0 [sritz] insert AltLabel (id: null text: Aventech AIMMS-30 Airborne Wind Sensor language code: en); insert Definition (id: null text: AIMMS-30 is Aventech's third generation wind measurement system which is capable of providing accurate GPS, inertial rates, air-data and meteorological data including: Barometric (Static) Pressure Air Speed (including TAS) Angle-of-Attack (AOA) Angle-of-Sideslip (AOS) Temperature (OAT) Relative Humidity language code: en);
change note: 2017-03-08 16:31:10.0 [sritz] Insert Concept add broader relation (AIMMS-30 [eae6f11d-fdd5-4e31-b119-aa00e6633da8,278685] - Current/Wind Meters [1b41692e-c7fe-4567-bed9-b938a7400462,258115]);
in scheme: instruments
definition: AIMMS-30 is Aventech's third generation wind measurement system which is capable of providing accurate GPS, inertial rates, air-data and meteorological data including: Barometric (Static) Pressure Air Speed (including TAS) Angle-of-Attack (AOA) Angle-of-Sideslip (AOS) Temperature (OAT) Relative Humidity

Current/Wind Meters
type: Concept