CA/EC/CIS
type: Concept
in scheme: providers
definition: "http://www.cis.ec.gc.ca/" Our business is to promote safe and efficient maritime operations and protect Canada's environment by providing reliable and timely information about ice and iceberg conditions in Canadian waters.

CANADA
type: Concept