GLACIAL PROCESSES
type: Concept

DEGRADATION
type: Concept
change note: 2013-08-26 09:02:04.0 [tbs1979] insert Definition (id: null text: Refers to the lowering of a fluvial surface, such as a stream bed or floodplain, through erosional processes. language code: en);
change note: 2013-08-06 15:07:13.0 [tbs1979] Insert Concept add broader relation (DEGRADATION [eb31cb40-97cf-4445-8abd-d375391edf6f,105697] - GLACIAL PROCESSES [b409a30b-0e3f-4592-bec9-7d371797b4a9,85295]);
in scheme: sciencekeywords
definition: Refers to the lowering of a fluvial surface, such as a stream bed or floodplain, through erosional processes.