Earth Observation Satellites
type: Concept

PACE
type: Concept
change note: 2021-11-18 12:48:57.0 [tstevens] Move Concepts delete broader relation (null); add broader relation (PACE [eb4175de-3ee7-4897-bbbe-590ad7e09b4f,826872] - Earth Observation Satellites [3466eed1-2fbb-49bf-ab0b-dc08731d502b,826121]);
change note: 2019-04-30 12:20:10.0 [sritz] insert AltLabel (id: null category: primary text: Plankton, Aerosol, Cloud, ocean Ecosystem mission language code: en);
change note: 2021-11-18 12:46:15.0 [tstevens] Move Concepts delete broader relation (null); add broader relation (PACE [eb4175de-3ee7-4897-bbbe-590ad7e09b4f,826872] - Space-based Platforms [b39a69b4-c3b9-4a94-b296-bbbbe5e4c847,835875]);
change note: 2019-04-30 12:21:25.0 [sritz] insert Definition (id: null text: PACE is NASA's Plankton, Aerosol, Cloud, ocean Ecosystem mission, currently in the design phase of mission development. It is scheduled to launch in 2022, extending and improving NASA's over 20-year record of satellite observations of global ocean biology, aerosols (tiny particles suspended in the atmosphere), and clouds. PACE will advance the assessment of ocean health by measuring the distribution of phytoplankton, tiny plants and algae that sustain the marine food web. It will also continue systematic records of key atmospheric variables associated with air quality and Earth's climate. More information: https://pace.gsfc.nasa.gov/ language code: en);
change note: 2019-04-30 12:17:43.0 [sritz] Insert Concept add broader relation (PACE [eb4175de-3ee7-4897-bbbe-590ad7e09b4f,368729] - Earth Observation Satellites [3466eed1-2fbb-49bf-ab0b-dc08731d502b,344761]);
definition: PACE is NASA's Plankton, Aerosol, Cloud, ocean Ecosystem mission, currently in the design phase of mission development. It is scheduled to launch in 2022, extending and improving NASA's over 20-year record of satellite observations of global ocean biology, aerosols (tiny particles suspended in the atmosphere), and clouds. PACE will advance the assessment of ocean health by measuring the distribution of phytoplankton, tiny plants and algae that sustain the marine food web. It will also continue systematic records of key atmospheric variables associated with air quality and Earth's climate. More information: https://pace.gsfc.nasa.gov/
in scheme: platforms