M - O
type: Concept

MOHAVE
type: Concept
in scheme: projects
definition: Project MOHAVE was an extensive monitoring, modeling, and data assessment project designed to estimate the contributions of the Mohave Power Plant (MPP) to haze at the Grand Canyon National Park (GCNP). The field study component of the project was conducted in 1992 and contained two intensive monitoring periods (~30 days in the winter and ~50 days in the summer). Unique, non-depositing, non-reactive perfluorocarbon tracer (PFT) materials were continuously released from the MPP stack during the two intensive periods to enable the tracking of emissions specifically from MPP. Tracer, ambient particulate composition, and SO2 concentrations were measured at about 30 locations in a four-state region. Two of these monitoring sites, Hopi Point (HOPO) near the main visitor center at the south rim of the canyon and Meadview (MEAD) near the far western end of the national park were used as key receptor sites representative of GCNP. Project MOHAVE operated under the joint technical and program management of the Environmental Protection Agency (EPA) and Southern California Edison (SCE) in close partnership with the National Park Service (NPS). Numerous other organizations contributed to the operations and assessment work of the project. Since the end of the field study component of the project, data assessment and modeling efforts were undertaken by the many participants and have led to numerous papers and reports. By design these efforts have been the products of their respective authors and have not been endorsed as findings of Project MOHAVE. The primary goal of Project MOHAVE was to determine the contribution of the MPP emissions to haze at GCNP and other nearby mandatory Class I areas where visibility is an important air quality related value. Secondary goals included an increased knowledge of the contributions of other sources to haze in GCNP and the southwestern United States in general. The specific objectives to accomplish these goals were: 1.Evaluate the measurements f…