Acoustic Sounders
type: Concept

INFRASONIC MICROPHONES
type: Concept
in scheme: instruments
definition: INFRASONIC MICROPHONES are microphones (devices that amplifie noise and sound) that refer to sound frequencies lower than those at the lower limit of average, unimpaired human hearing, which is about 16 to 30 Hz.