WU-SL/EPS/MARGINS
type: Concept
in scheme: providers
definition: The MARGINS research program has been formulated to understand the complex interplay of processes that govern continental margin evolution globally. Mechanical, chemical, biological and fluid processes act in concert to govern the initiation, evolution and eventual destruction of continental margins, as well as the accumulation of resources in these regions. The MARGINS Program is jointly supported by the Divisions of Earth and Ocean Sciences of the Directorate for Geosciences. Website: http://www.margins.wustl.edu/MARGINS_Office/AboutMARGINS.html http://www.margins.wustl.edu/MARGINS_Office/AboutMARGINS.html Info:Margins

ACADEMIC
type: Concept